no,Age,Gender,Grade,national,Book read in a year,social event in a year,residence,reason for the medical faculty,disease,kvs,akciğer,böbrek,Tiroid,MARFAN ,dersleri nerden takip ,anxiety,pandemic anxiety,Distance learning satisfaction ,Benefits ,Drawbacks ,Future learning preferences ,C1,C2,C3,C4,C5,C6,C7,B1,B2,B3,B4,B5,B6,B7,B8,B9,B10,B11,B12,B13,B14,B15,B16,B17,B18,B19,B20,V,A,R,K
1.0,18,0,1,1,3,3,2,1,0,,,,,,1,0,1,0,5,3,3,,,,,,,,5,5,1,2,4,4,1,4,4,4,1,1,4,3,1,2,3,4,2,1,1,9,4,2
2.0,24,0,5,1,1,1,1,1,1,1,,,,,2,0,1,0,5,5,3,,,,,,,,4,3,2,4,4,5,2,4,4,4,2,2,4,5,1,2,3,4,2,3,3,6,4,3
3.0,19,1,2,1,0,3,2,3,2,,,,1.0,1.0,2,0,1,1,5,5,2,,,,,,,,4,4,1,4,4,2,1,4,3,2,5,4,3,1,5,5,1,1,4,5,11,2,1,2
4.0,20,0,2,1,1,1,1,1,0,,,,,,1,0,1,0,2,4,3,,,,,,,,4,3,2,4,4,5,2,4,4,4,2,2,4,5,1,2,3,4,2,3,8,2,3,3
5.0,20,1,3,1,2,2,4,1,2,,1,,1.0,,1,0,1,2,3,2,2,,,,,,,,4,4,1,2,5,2,3,5,4,4,3,2,3,1,2,3,1,1,1,4,4,4,5,3
6.0,23,1,3,1,2,3,4,1,0,,,,,,1,0,1,1,1,6,3,,,,,,,,3,5,1,1,4,3,1,5,5,5,1,3,4,1,1,5,1,3,1,1,1,8,2,5
7.0,21,0,2,1,3,3,2,1,2,1,1,,,,1,1,2,0,5,5,2,,,,,,,,3,4,3,2,1,1,4,3,1,2,3,4,1,1,4,4,1,1,5,5,5,9,1,1
8.0,20,1,2,1,3,3,4,3,1,,,1.0,,,2,1,1,1,3,2,3,,,,,,,,1,1,5,3,2,4,2,1,5,2,1,1,2,1,5,3,1,1,4,5,3,6,3,4
9.0,21,0,3,1,3,3,3,1,0,,,,,,3,0,3,0,5,5,2,,,,,,,,4,3,1,3,2,3,1,5,4,4,2,2,4,1,2,2,2,2,1,1,5,7,2,2
10.0,22,1,3,1,1,2,4,1,1,,1,,,,2,1,1,0,5,5,2,,,,,,,,4,4,3,4,2,1,3,4,1,4,4,5,1,1,5,5,1,3,4,3,1,4,3,8
11.0,20,1,2,1,2,2,4,1,0,,,,,,3,0,1,0,5,4,2,,,,,,,,3,3,3,3,3,3,2,4,3,3,4,3,3,2,3,3,3,3,3,5,5,3,5,3
12.0,20,1,3,1,0,2,2,3,0,,,,,,3,0,1,0,2,4,2,,,,,,,,4,3,3,1,4,4,1,1,4,3,1,2,3,3,2,3,3,2,2,3,3,8,2,3
13.0,20,1,2,1,2,2,1,1,0,,,,,,3,0,4,0,3,5,3,,,,,,,,4,4,1,4,2,2,1,2,1,2,1,2,3,3,1,1,1,3,1,4,4,7,2,3
14.0,22,0,3,1,0,1,4,1,0,,,,,,3,0,3,1,1,6,3,,,,,,,,1,3,4,3,1,1,4,3,2,3,3,3,1,1,4,4,1,1,3,2,4,7,3,2
15.0,22,0,3,1,0,2,4,1,0,,,,,,3,0,1,0,2,4,2,,,,,,,,5,5,3,3,5,4,1,4,3,4,5,1,4,3,5,3,2,1,2,2,4,2,2,8
16.0,22,0,3,1,2,2,1,1,0,,,,,,2,0,1,0,3,3,2,,,,,,,,3,4,4,5,5,3,3,3,3,3,4,4,4,3,3,3,3,3,3,3,4,4,6,2
17.0,21,1,2,1,2,2,2,2,0,,,,,,1,0,1,0,5,5,2,,,,,,,,5,5,4,4,4,4,4,4,3,3,3,3,4,4,4,4,4,4,3,3,3,5,4,4
18.0,21,1,3,1,2,1,4,3,0,,,,,,2,0,3,0,2,3,2,,,,,,,,5,5,4,4,4,4,4,3,3,3,3,5,5,2,2,2,2,2,2,2,4,6,3,3
19.0,21,1,3,1,2,1,4,3,0,,,,,,2,0,1,0,2,3,2,,,,,,,,4,4,4,4,4,3,3,3,3,3,3,4,4,4,4,2,2,2,2,2,4,7,2,3
20.0,21,0,3,1,1,1,3,3,0,,,,,,1,0,1,0,4,3,2,,,,,,,,4,4,4,4,5,5,3,3,3,3,3,3,4,4,4,4,3,3,3,3,3,3,4,6
21.0,21,1,3,1,1,1,1,3,0,,,,,,1,0,1,1,4,3,2,,,,,,,,4,4,4,3,3,3,3,4,4,4,4,4,4,3,3,3,3,2,2,2,4,3,2,7
22.0,21,1,3,1,1,1,2,3,0,,,,,,1,0,1,0,3,3,2,,,,,,,,4,4,5,5,5,2,2,2,2,3,3,3,3,3,3,3,3,3,3,2,3,4,3,6
23.0,20,0,3,1,1,1,2,1,0,,,,,,1,0,1,0,3,3,2,,,,,,,,3,3,3,3,4,4,4,4,2,2,2,3,3,3,3,3,3,3,3,3,3,2,2,9
24.0,21,1,3,2,2,1,2,1,0,,,,,,1,0,1,0,5,3,2,,,,,,,,3,3,2,2,2,3,3,3,4,4,4,4,4,5,5,5,3,3,3,3,4,3,3,6
25.0,18,1,1,1,3,1,1,1,0,,,,,,1,0,1,0,5,4,3,,,,,,,,3,2,5,4,1,3,4,3,2,2,3,5,2,2,5,4,2,2,5,4,3,6,2,5
26.0,18,1,1,2,3,3,4,1,0,,,,,,1,0,1,1,2,6,2,,,,,,,,5,5,3,4,2,2,1,2,3,2,1,1,3,2,2,4,3,3,2,1,4,4,7,1
27.0,19,1,1,2,3,3,1,1,0,,,,,,2,0,3,0,5,5,2,,,,,,,,3,3,5,4,2,2,5,5,2,4,5,5,1,2,5,4,2,3,5,5,3,3,7,3
28.0,18,1,1,1,3,3,1,1,0,,,,,,2,0,3,0,5,3,2,,,,,,,,3,3,2,2,2,2,2,3,3,5,1,2,4,2,2,2,2,2,2,2,1,5,4,6
29.0,24,0,6,2,0,1,1,2,0,,,,,,2,0,1,0,5,3,2,,,,,,,,3,3,2,2,2,2,2,3,3,5,1,2,3,3,3,2,2,2,2,2,1,5,4,6
30.0,21,0,1,2,1,1,2,1,0,,,,,,2,0,1,0,5,3,2,,,,,,,,3,3,2,3,2,2,2,2,2,5,1,2,3,3,3,3,2,2,2,2,2,4,4,6
31.0,17,1,1,1,3,3,1,1,0,,,,,,2,0,3,0,4,3,2,,,,,,,,3,2,4,2,4,2,2,1,2,4,1,3,2,2,1,3,4,3,3,1,1,9,3,3
32.0,24,1,6,2,3,3,1,1,0,,,,,,2,0,4,0,1,5,2,,,,,,,,2,2,1,2,2,4,1,3,5,4,2,2,3,3,1,2,2,4,2,1,1,11,3,1
33.0,18,0,1,1,3,3,1,1,0,,,,,,2,0,1,0,1,5,2,,,,,,,,4,5,1,1,3,4,2,3,4,5,1,2,4,3,4,5,3,2,2,1,2,2,4,8
34.0,25,0,6,1,3,3,1,1,0,,,,,,1,0,3,0,1,5,2,,,,,,,,4,2,3,4,1,3,3,4,3,4,2,4,3,1,3,4,2,4,2,4,4,7,2,3
35.0,20,1,3,1,3,2,1,1,0,,,,,,3,0,3,0,1,4,3,,,,,,,,5,3,3,2,4,3,2,4,3,3,2,2,3,2,2,4,2,2,2,4,2,2,3,9
36.0,20,0,3,2,1,3,3,2,0,,,,,,3,0,3,2,1,1,3,,,,,,,,2,3,4,3,2,2,3,4,2,3,4,3,2,2,3,4,3,2,3,4,1,5,5,5
37.0,21,0,3,1,1,2,3,1,0,,,,,,3,0,3,0,5,4,2,,,,,,,,5,3,4,4,3,2,1,1,2,3,2,4,1,5,1,2,2,2,2,3,2,6,5,3
38.0,24,1,6,1,3,1,4,1,0,,,,,,3,0,3,0,5,4,2,,,,,,,,4,4,2,3,2,2,2,4,4,3,2,2,3,1,2,3,2,2,2,2,4,4,6,2
39.0,21,0,3,1,1,0,4,1,0,,,,,,3,1,1,0,5,4,2,,,,,,,,3,5,1,5,1,2,1,5,3,5,1,5,3,1,1,5,1,1,5,1,3,2,8,3
40.0,21,1,3,1,3,2,1,1,1,1,,,,,3,0,1,0,2,2,2,,,,,,,,4,3,1,2,3,2,2,3,3,3,3,2,3,1,2,2,2,1,2,2,4,5,4,3
41.0,26,1,3,1,1,0,3,1,0,,,,,,3,0,1,0,5,4,2,,,,,,,,4,5,2,3,2,3,1,3,3,3,2,2,4,4,1,5,4,5,1,4,3,4,7,2
42.0,21,0,3,1,3,1,4,2,0,,,,,,3,0,1,0,5,4,3,,,,,,,,5,5,1,5,1,4,5,4,2,2,4,4,1,1,4,1,2,5,4,4,4,4,6,2
43.0,24,1,5,2,1,1,4,1,0,,,,,,3,0,4,2,1,1,2,,,,,,,,4,5,1,2,2,2,2,5,2,5,5,2,5,2,1,2,2,2,1,2,6,4,2,4
44.0,20,1,3,1,3,1,3,1,2,,1,1.0,,,2,0,1,0,5,4,2,,,,,,,,4,4,3,4,4,4,2,5,5,5,2,2,5,4,2,3,2,5,3,2,5,0,6,5
45.0,19,1,1,1,3,1,2,1,0,,,,,,1,0,1,0,5,4,2,,,,,,,,5,2,2,4,1,1,2,5,1,5,3,4,1,1,3,5,3,1,5,5,3,4,4,5
46.0,18,1,1,2,3,1,1,1,0,,,,,,2,0,1,0,5,4,2,,,,,,,,2,3,1,1,4,2,5,3,1,3,4,1,3,4,1,3,2,3,4,2,3,6,3,4
47.0,20,1,1,2,0,2,1,1,0,,,,,,3,0,3,0,5,4,2,,,,,,,,3,4,4,2,3,2,4,2,2,3,3,5,4,1,3,2,3,4,3,4,3,4,3,6
48.0,25,1,6,1,2,2,1,1,0,,,,,,2,0,3,2,1,1,1,,,,,,,,5,5,1,2,3,5,1,2,3,5,1,1,2,2,1,3,5,5,1,3,0,6,5,5
49.0,18,0,1,1,3,2,4,1,0,,,,,,1,0,2,2,4,5,2,,,,,,,,5,4,1,2,4,5,1,3,5,5,1,2,5,5,2,2,5,5,1,4,1,9,5,1
50.0,18,1,1,1,2,3,1,1,0,,,,,,2,0,2,0,5,4,2,,,,,,,,5,5,1,2,3,2,1,2,4,5,1,1,5,3,1,2,3,4,2,5,6,2,3,5
51.0,21,1,1,2,1,0,4,1,0,,,,,,2,0,2,0,4,4,2,,,,,,,,3,4,1,3,2,3,1,4,3,5,1,3,4,2,2,4,1,3,2,4,2,8,5,1
52.0,20,1,1,2,0,1,4,1,0,,,,,,2,0,2,0,5,4,2,,,,,,,,3,4,1,4,3,2,1,5,1,4,1,3,5,1,1,4,4,3,3,4,2,8,2,4
53.0,19,0,1,2,2,2,4,1,0,,,,,,2,0,4,0,3,3,3,,,,,,,,4,4,1,2,4,5,1,5,5,4,2,1,5,5,1,2,4,4,5,2,12,2,1,1
54.0,20,0,1,2,3,1,1,1,0,,,,,,2,0,1,2,5,3,2,,,,,,,,5,4,3,1,1,5,1,5,4,4,1,1,2,4,1,3,3,3,2,3,5,6,2,3
55.0,21,1,3,1,2,2,2,2,0,,,,,,2,0,3,1,1,6,1,,,,,,,,2,2,4,4,1,1,5,5,2,2,4,4,1,2,5,5,2,1,4,5,6,8,1,1
56.0,22,0,4,1,2,2,2,2,0,,,,,,2,0,3,1,1,5,1,,,,,,,,1,1,4,5,2,2,4,5,2,2,4,4,1,2,5,5,2,2,4,4,6,5,3,2
57.0,21,1,2,1,2,1,2,2,0,,,,,,3,0,3,1,1,6,1,,,,,,,,2,2,4,4,3,2,4,3,3,2,4,4,1,2,5,5,2,1,4,4,7,5,2,2
58.0,20,1,2,1,2,1,2,2,0,,,,,,2,0,3,1,3,6,1,,,,,,,,1,1,4,4,2,2,4,4,2,2,4,4,2,2,4,4,2,2,4,5,5,7,2,2
59.0,21,1,2,1,2,2,2,2,0,,,,,,3,0,3,1,3,6,1,,,,,,,,2,1,4,4,1,1,5,5,2,2,4,5,1,1,4,5,2,2,4,4,4,8,2,2
60.0,20,0,2,1,2,2,1,2,0,,,,,,3,0,3,1,3,6,1,,,,,,,,1,1,4,5,3,3,3,5,2,3,3,4,2,2,4,5,3,3,3,3,3,8,2,3
61.0,20,1,2,1,2,2,2,2,0,,,,,,3,0,3,1,3,5,1,,,,,,,,2,2,4,4,2,2,4,5,1,1,4,5,2,2,4,4,2,2,4,5,3,8,2,3
62.0,19,1,2,1,2,2,2,2,0,,,,,,3,0,4,1,5,6,1,,,,,,,,1,1,4,5,2,2,4,5,3,3,3,4,5,1,3,4,4,5,4,4,2,7,3,4
63.0,20,0,2,2,2,2,2,2,0,,,,,,3,0,3,1,3,6,1,,,,,,,,2,2,4,4,1,2,4,5,2,2,4,4,1,1,4,5,2,2,4,5,8,2,4,2
64.0,24,1,5,1,2,2,3,2,0,,,,,,3,0,5,1,3,6,1,,,,,,,,2,1,3,4,2,2,5,5,1,1,4,5,2,1,4,5,1,2,4,5,7,3,3,3
65.0,21,1,2,1,2,3,3,2,0,,,,,,1,0,4,1,3,6,1,,,,,,,,1,1,4,5,2,2,4,5,3,3,3,4,2,1,4,5,2,2,4,5,7,3,3,3
66.0,19,0,1,1,3,3,2,3,0,,,,,,1,0,1,2,1,1,3,,,,,,,,2,2,4,4,2,2,4,5,1,2,3,4,4,5,4,5,3,2,2,5,6,3,3,4
67.0,20,1,4,1,2,2,2,3,0,,,,,,2,0,2,2,1,1,2,,,,,,,,3,3,4,4,2,3,4,5,2,2,4,4,3,3,3,3,3,3,3,3,7,3,3,3
68.0,25,1,5,2,2,3,2,3,0,,,,,,2,0,1,2,1,1,3,,,,,,,,2,2,4,5,2,2,4,4,2,2,4,4,1,2,4,4,2,1,4,5,6,5,2,3
69.0,22,0,4,2,2,3,2,3,0,,,,,,2,0,1,2,1,6,3,,,,,,,,2,2,4,5,1,2,4,5,1,2,4,5,2,2,4,5,1,2,4,5,7,3,3,3
70.0,23,1,4,1,2,3,2,3,0,,,,,,2,0,3,2,1,6,1,,,,,,,,5,2,3,3,3,4,3,2,3,3,3,2,3,2,3,2,3,4,3,2,5,5,3,3
71.0,22,1,3,2,2,2,2,2,0,,,,,,2,0,3,0,2,3,1,,,,,,,,3,4,3,2,3,4,5,4,3,3,3,3,3,3,3,3,3,3,3,3,3,10,2,1
72.0,21,0,1,1,2,2,3,2,0,,,,,,2,0,1,0,3,1,1,,,,,,,,3,4,5,4,3,3,3,3,2,2,3,3,3,2,2,3,3,3,3,3,3,4,5,4
73.0,24,1,6,2,2,2,3,2,0,,,,,,2,0,1,0,4,4,2,,,,,,,,5,4,2,2,4,4,2,2,1,3,4,2,1,4,4,2,2,4,5,2,3,7,3,3
74.0,24,0,5,2,2,2,3,2,0,,,,,,2,0,1,0,4,4,2,,,,,,,,4,5,2,2,4,4,2,2,5,4,2,2,4,5,2,2,4,4,2,1,4,7,2,3
75.0,23,1,5,1,3,3,2,1,0,,,,,,2,0,2,0,4,4,2,,,,,,,,4,5,3,3,3,4,3,3,3,3,4,2,2,3,3,3,3,3,3,3,7,4,2,3
76.0,22,1,1,2,2,2,3,2,0,,,,,,2,0,3,0,1,4,3,,,,,,,,4,3,2,2,2,3,2,3,3,4,2,2,3,4,4,3,2,4,2,3,6,5,2,3
77.0,18,1,1,1,2,2,3,1,0,,,,,,2,1,4,0,5,5,2,,,,,,,,4,4,3,4,4,3,2,3,4,3,2,2,4,2,4,5,1,4,3,5,2,4,8,2
78.0,19,1,1,1,2,2,1,1,1,hipertansiyon,,,,,2,1,1,0,5,1,2,,,,,,,,5,5,1,1,4,5,2,2,5,4,1,1,5,5,4,2,1,3,1,1,7,3,2,4
79.0,19,1,1,1,2,0,1,1,0,,,,,,2,0,2,0,1,1,2,,,,,,,,3,5,2,2,4,3,2,4,1,4,2,2,3,1,1,2,2,2,4,4,3,3,3,7
80.0,18,0,1,1,3,0,4,1,0,,,,,,2,0,1,0,1,1,3,,,,,,,,5,4,1,3,4,4,1,2,4,5,1,1,5,2,2,1,1,1,2,1,2,3,6,5
81.0,19,0,1,2,3,2,3,3,2,1,,1.0,,,2,0,3,0,1,4,3,,,,,,,,2,5,1,3,2,3,1,4,5,4,2,3,3,2,1,2,2,4,3,4,4,3,7,2
82.0,18,1,1,1,2,2,1,1,0,,,,,,2,0,3,0,5,4,2,,,,,,,,2,3,2,2,4,3,2,3,4,3,1,2,3,3,2,2,3,4,2,2,7,5,2,2
83.0,18,0,1,1,1,3,4,1,0,,,,,,2,0,2,0,5,2,2,,,,,,,,2,4,3,1,4,4,4,1,5,5,1,2,3,5,1,2,3,3,2,4,1,8,2,5
84.0,18,0,1,1,2,2,4,1,0,,,,,,2,0,1,0,5,1,2,,,,,,,,3,5,3,2,5,5,3,3,3,5,3,3,3,4,2,4,2,2,1,3,7,2,5,2
85.0,19,0,1,1,2,2,4,1,1,,,,,,2,1,3,0,1,3,2,,,,,,,,5,2,1,5,2,5,1,5,4,5,2,4,5,4,4,1,5,5,2,2,5,4,4,3
86.0,19,0,1,1,3,3,1,1,1,,,,,,2,1,4,0,1,4,2,,,,,,,,5,5,1,2,5,4,1,2,4,5,2,3,4,4,2,1,2,2,2,5,2,3,4,7
87.0,19,0,1,1,2,3,3,1,0,,,,,,2,0,3,0,1,5,3,,,,,,,,2,4,3,3,2,3,1,3,2,4,1,4,2,2,1,4,2,3,3,3,9,0,3,4
88.0,24,1,5,1,2,2,3,1,0,,,,,,2,1,1,0,3,3,2,,,,,,,,3,4,5,4,2,3,3,2,3,5,2,4,3,2,3,4,5,2,5,1,2,2,8,4
89.0,18,1,1,1,3,1,1,3,0,,,,,,2,1,1,0,2,3,2,,,,,,,,3,3,2,3,4,3,1,2,2,4,1,3,2,1,1,3,2,3,2,1,1,3,3,9
90.0,18,1,1,2,3,3,1,1,0,,,,,,2,0,3,0,2,3,2,,,,,,,,4,5,1,1,4,2,1,5,4,5,2,1,5,2,3,4,2,4,1,3,5,6,3,2
91.0,24,1,5,2,1,1,1,1,0,,,,,,2,0,4,0,5,3,3,,,,,,,,3,2,2,3,3,3,3,5,3,3,3,2,3,2,2,3,2,3,3,2,4,4,2,6
92.0,18,1,1,1,3,0,2,1,0,,,,,,2,0,3,0,5,3,3,,,,,,,,5,5,1,5,5,5,1,5,5,5,1,1,5,1,1,1,1,5,1,1,5,4,4,3
93.0,24,1,6,1,1,2,4,1,0,,,,,,2,0,3,0,5,3,3,,,,,,,,3,4,2,1,3,3,1,4,3,3,3,2,3,3,2,2,3,2,2,1,3,2,6,5
94.0,19,1,1,1,3,1,4,1,0,,,,,,2,0,3,0,2,3,3,,,,,,,,1,3,4,2,3,3,2,4,2,5,3,3,2,1,2,3,2,2,2,4,0,7,6,3
95.0,21,0,4,2,2,1,4,1,0,,,,,,2,0,3,2,2,4,1,,,,,,,,3,4,2,2,4,3,1,2,4,4,2,2,4,1,2,4,2,3,1,3,1,4,5,6
96.0,23,0,4,1,3,3,4,1,0,,,,,,2,0,3,0,5,5,3,,,,,,,,3,4,2,4,2,1,2,2,2,5,2,4,2,1,1,2,1,1,2,2,3,3,1,9
97.0,23,0,4,1,3,1,4,1,0,,,,,,2,1,1,0,5,5,3,,,,,,,,3,4,3,2,4,3,5,4,3,2,2,4,3,3,3,3,2,1,1,2,2,7,3,4
98.0,18,0,1,2,1,1,2,1,0,,,,,,2,0,1,0,4,4,2,,,,,,,,4,4,3,3,3,3,4,1,3,4,1,3,4,3,3,3,2,2,2,2,2,2,3,9
99.0,19,1,1,1,1,3,3,2,0,,,,,,2,0,2,2,1,3,3,,,,,,,,2,2,3,3,3,2,2,4,3,2,4,4,3,3,3,3,3,3,3,3,4,6,5,1
100.0,19,0,1,1,0,0,4,3,0,,,,,,2,0,1,2,1,2,1,,,,,,,,1,1,2,3,3,2,5,4,3,3,4,3,3,2,2,3,3,2,3,3,12,2,1,1
101.0,19,1,1,1,1,1,4,1,0,,,,,,2,0,3,2,1,3,3,,,,,,,,3,3,3,3,4,4,4,2,2,2,3,3,3,3,2,4,4,4,4,4,2,2,8,4
102.0,19,1,1,1,1,1,3,1,0,,,,,,2,0,3,1,1,3,3,,,,,,,,4,2,4,3,3,3,3,1,3,3,3,3,4,2,2,2,2,2,3,3,12,0,2,2
103.0,20,0,1,1,0,0,1,2,0,,,,,,2,0,2,1,1,2,3,,,,,,,,1,1,3,1,2,3,5,5,3,3,5,3,3,3,3,3,1,1,1,1,2,3,2,9
104.0,20,0,1,1,0,0,1,3,0,,,,,,1,0,1,1,1,6,1,,,,,,,,1,1,4,3,3,2,4,4,3,3,3,3,3,2,2,3,3,2,4,2,11,2,3,0
105.0,25,0,6,1,1,2,3,1,0,,,,,,2,0,1,0,5,2,2,,,,,,,,5,4,2,2,4,4,1,2,4,4,2,3,3,4,2,4,3,4,2,2,3,3,2,8
106.0,24,1,6,1,2,2,2,3,0,,,,,,2,0,1,0,5,5,2,,,,,,,,5,4,3,2,4,4,3,2,3,3,3,2,4,4,3,2,4,5,2,1,2,2,1,11
107.0,18,0,1,1,2,2,2,3,0,,,,,,2,0,4,2,1,2,3,,,,,,,,3,4,3,3,3,3,2,2,4,4,2,3,3,4,2,3,4,3,3,2,8,3,3,2
108.0,19,1,1,1,3,3,3,1,0,,,,,,2,0,1,0,5,5,2,,,,,,,,5,5,1,5,5,4,1,1,4,5,1,3,5,3,3,3,3,4,2,2,2,2,2,10
109.0,24,1,6,1,2,1,2,1,0,,,,,,2,0,1,0,4,5,2,,,,,,,,4,4,1,4,3,3,3,1,4,1,2,4,2,3,2,3,4,3,3,3,8,2,3,3
110.0,21,0,4,1,1,2,4,3,0,,,,,,3,0,1,0,3,3,2,,,,,,,,2,4,4,4,3,4,2,2,2,4,2,3,1,2,2,2,1,2,2,1,7,4,3,2
111.0,24,1,6,1,2,2,3,1,0,,,,,,2,0,1,0,5,5,2,,,,,,,,4,4,1,4,2,3,3,3,3,5,1,3,3,4,3,4,3,3,2,1,2,2,1,11
112.0,24,0,6,2,2,2,2,1,0,,,,,,2,0,1,0,5,4,2,,,,,,,,4,4,4,3,3,4,2,2,4,4,4,3,3,3,3,1,4,4,2,2,8,6,1,1
113.0,25,1,6,1,0,0,2,2,0,,,,,,2,0,1,0,5,4,2,,,,,,,,5,5,5,3,3,4,1,2,3,3,3,3,3,4,4,3,3,4,4,4,7,5,2,2
114.0,21,1,4,1,3,3,3,1,0,,,,,,3,0,2,2,1,3,2,,,,,,,,2,4,1,1,2,2,1,4,2,4,2,1,4,2,2,4,2,2,2,2,2,5,5,4
115.0,22,1,4,1,2,1,3,1,0,,,,,,3,0,2,2,1,5,3,,,,,,,,1,5,3,5,3,5,2,2,5,5,4,4,4,3,5,5,2,3,5,4,4,3,7,2
116.0,21,1,4,1,1,3,2,1,0,,,,,,2,0,3,0,5,4,2,,,,,,,,4,5,1,4,3,3,1,5,3,3,3,3,4,3,2,3,1,2,5,4,7,4,3,2
117.0,22,1,4,2,3,3,1,1,0,,,,,,3,0,3,2,1,4,3,,,,,,,,4,2,2,4,4,1,2,4,2,4,2,4,2,1,4,5,2,2,2,2,0,7,5,4
118.0,23,1,6,1,2,2,2,1,0,,,,,,3,0,1,2,3,1,3,,,,,,,,2,3,3,2,1,2,3,3,3,4,3,2,2,2,1,4,2,1,3,3,3,3,3,7
119.0,25,1,6,1,3,3,2,1,0,,,,,,3,0,1,1,3,5,3,,,,,,,,5,5,1,2,5,4,1,4,1,5,1,1,4,2,2,3,2,1,2,3,2,3,3,8
120.0,25,0,4,1,1,0,4,1,1,1,aritmi,,,,3,0,3,2,3,3,3,,,,,,,,1,4,3,2,4,2,4,2,2,2,1,2,2,2,1,2,1,2,3,4,3,3,3,7
121.0,25,0,6,1,0,0,4,1,0,,,,,,2,0,1,0,5,5,3,,,,,,,,3,1,5,1,3,3,1,4,1,2,4,1,4,1,2,3,1,3,2,5,5,1,5,5
122.0,22,1,6,1,3,2,4,1,1,görme kaybı,,,,,2,0,1,0,5,4,2,,,,,,,,3,5,2,4,2,1,2,5,2,3,5,1,3,1,1,1,1,2,1,4,2,2,5,7
123.0,25,1,6,1,1,3,2,2,0,,,,,,3,0,1,0,1,1,3,,,,,,,,5,5,2,2,3,4,1,2,2,5,1,2,3,2,4,3,3,1,3,4,4,6,2,4
124.0,23,1,5,1,3,3,3,1,0,,,,,,3,0,2,0,3,1,2,,,,,,,,3,2,4,4,2,3,2,2,3,2,2,4,2,2,5,5,2,3,4,3,1,4,5,6
125.0,24,0,6,1,1,2,3,1,0,,,,,,2,0,2,0,5,5,3,,,,,,,,3,3,1,2,4,3,1,2,4,4,1,1,4,4,1,3,3,2,2,1,1,6,5,4
126.0,23,0,1,1,1,2,1,2,0,,,,,,3,0,2,0,1,5,2,,,,,,,,3,5,2,2,2,2,1,3,2,2,3,3,2,3,2,1,2,2,2,1,0,4,4,8
127.0,22,0,3,1,3,3,1,3,0,,,,,,2,0,1,0,1,5,2,,,,,,,,3,5,2,2,5,2,1,3,2,2,3,2,3,2,1,3,3,3,3,2,1,4,4,7
128.0,23,0,4,1,1,0,1,1,0,,,,,,3,0,2,2,1,5,2,,,,,,,,1,1,2,2,1,2,1,4,1,2,2,2,2,1,1,1,3,5,1,3,1,8,3,4
129.0,24,0,6,2,1,0,1,1,0,,,,,,3,0,1,2,1,5,3,,,,,,,,1,1,2,2,2,2,1,3,1,2,2,2,2,2,2,1,2,2,1,2,3,6,2,5
130.0,20,0,2,1,0,2,1,1,0,,,,,,2,0,2,0,5,5,2,,,,,,,,1,1,2,2,2,2,1,4,1,2,2,2,2,1,1,1,2,2,1,2,1,10,2,3
131.0,29,0,4,1,3,3,2,1,0,,,,,,3,0,2,0,1,5,3,,,,,,,,4,4,3,3,4,2,3,1,4,4,2,2,1,2,2,3,1,2,2,5,3,2,2,9
132.0,21,1,4,1,3,3,1,1,0,,,,,,3,0,1,0,1,5,3,,,,,,,,5,5,1,4,4,2,2,4,3,3,3,3,3,4,2,4,2,4,3,3,3,5,7,1
133.0,24,1,4,1,3,3,2,1,0,,,,,,3,0,1,2,5,5,2,,,,,,,,2,3,5,3,2,2,3,3,2,3,3,2,3,4,2,2,2,3,2,2,2,4,3,7
134.0,21,0,4,1,1,2,4,1,0,,,,,,2,0,1,0,1,5,3,,,,,,,,3,5,4,1,4,5,1,2,3,4,1,2,4,4,3,4,3,2,1,2,3,5,2,6
135.0,21,1,4,1,3,3,4,2,0,,,,,,2,0,1,0,1,3,3,,,,,,,,2,2,5,5,2,2,5,2,1,2,2,4,1,1,3,3,1,1,5,3,5,7,2,2
136.0,21,1,4,1,3,3,3,3,0,,,,,,2,0,1,0,1,3,3,,,,,,,,2,2,5,5,2,1,4,2,1,2,2,4,2,2,3,3,3,1,5,3,5,7,2,2
137.0,22,1,4,1,3,3,3,2,0,,,,,,2,0,1,0,1,3,3,,,,,,,,2,2,4,4,2,1,4,2,1,2,2,4,2,2,3,3,3,2,4,3,4,7,3,2
138.0,25,1,6,1,3,3,2,2,0,,,,,,2,0,1,1,1,1,1,,,,,,,,1,2,4,5,2,2,4,5,1,2,5,5,2,2,5,4,2,2,4,4,6,6,2,2
139.0,24,0,6,1,3,3,2,2,0,,,,,,2,0,3,1,1,1,2,,,,,,,,2,2,4,4,2,2,5,5,1,1,5,5,2,1,4,4,2,1,4,5,7,5,2,2
140.0,24,0,6,1,2,2,2,2,0,,,,,,2,0,4,1,1,1,2,,,,,,,,2,1,4,3,2,3,4,4,1,2,4,3,1,1,4,3,2,1,4,3,7,4,3,2
141.0,24,1,6,1,3,2,3,2,0,,,,,,1,0,3,1,1,1,1,,,,,,,,1,2,3,4,2,1,4,5,2,2,4,5,3,3,4,3,1,2,4,5,6,6,2,2
142.0,25,1,6,1,3,2,3,3,0,,,,,,2,0,3,1,1,1,2,,,,,,,,2,1,4,3,2,2,5,5,2,1,3,3,3,4,4,2,2,2,4,5,7,5,2,2
143.0,24,0,5,1,2,3,2,2,0,,,,,,2,0,3,1,1,1,2,,,,,,,,1,2,3,3,4,2,2,4,2,1,3,3,3,4,4,2,2,2,4,5,6,5,2,3
144.0,25,0,6,1,2,2,2,2,0,,,,,,2,0,1,1,3,2,2,,,,,,,,1,2,4,4,2,1,4,5,2,1,5,4,2,1,4,5,2,2,4,5,8,4,2,2
145.0,25,1,5,1,2,2,3,3,0,,,,,,2,0,2,1,1,1,2,,,,,,,,1,2,4,5,2,2,4,5,2,1,4,5,2,1,5,5,2,1,4,5,8,4,2,2
146.0,24,1,6,2,2,3,2,2,0,,,,,,2,0,1,0,1,2,2,,,,,,,,1,2,4,5,2,2,4,5,2,2,5,4,2,1,3,3,4,5,2,1,7,5,2,2
147.0,25,1,6,2,3,2,2,2,0,,,,,,2,0,1,1,1,1,2,,,,,,,,1,1,3,4,2,1,4,5,2,1,3,4,5,2,2,4,3,2,1,3,8,4,2,2
148.0,25,0,6,1,3,2,2,3,0,,,,,,2,0,1,1,1,1,2,,,,,,,,1,2,3,4,3,3,3,3,2,1,3,4,4,2,1,4,5,2,1,3,8,5,2,1
149.0,24,1,6,1,3,2,2,2,0,,,,,,2,0,1,1,1,1,2,,,,,,,,1,2,4,3,2,3,4,4,2,1,4,5,2,2,5,5,2,1,4,5,7,5,2,2
150.0,25,0,6,1,2,2,3,3,0,,,,,,2,0,1,1,2,2,2,,,,,,,,2,2,4,5,2,2,4,3,2,2,3,4,2,5,5,2,1,1,3,4,8,1,3,4
151.0,24,1,6,2,3,3,3,2,0,,,,,,2,0,2,1,1,1,3,,,,,,,,2,2,4,4,2,1,4,5,2,3,5,5,3,1,3,1,1,5,5,3,7,2,4,3
152.0,25,1,6,2,3,2,2,2,0,,,,,,2,0,1,1,1,1,3,,,,,,,,5,4,2,2,4,5,2,1,4,5,3,2,4,4,3,3,4,4,5,5,7,2,5,2
153.0,24,0,6,2,3,3,2,2,0,,,,,,2,0,2,1,1,1,2,,,,,,,,5,4,2,2,4,5,2,1,3,4,2,1,3,5,2,1,4,5,2,2,8,1,5,2
154.0,24,0,5,2,3,2,2,2,0,,,,,,2,0,3,1,1,2,2,,,,,,,,5,5,2,2,4,5,2,1,4,5,1,2,4,4,2,1,4,5,1,2,9,1,4,2
155.0,24,1,6,2,2,2,2,2,0,,,,,,2,0,3,1,1,2,2,,,,,,,,5,4,2,2,4,5,2,1,4,5,2,2,4,4,2,1,5,4,2,2,8,2,3,3
156.0,19,1,1,2,2,2,3,2,0,,,,,,1,0,4,1,1,2,3,,,,,,,,2,1,3,4,5,2,1,4,5,2,1,5,5,1,2,4,5,1,3,5,5,5,3,3
157.0,25,1,6,1,2,3,1,2,0,,,,,,2,0,1,0,1,1,2,,,,,,,,5,4,2,1,4,4,2,1,5,4,2,1,4,5,2,1,3,3,3,5,7,2,3,4
158.0,19,0,2,2,3,2,2,2,0,,,,,,1,1,1,1,1,2,1,,,,,,,,1,2,3,4,2,1,5,4,2,1,5,4,2,1,4,5,1,2,4,5,8,2,3,3
159.0,24,0,6,2,3,2,3,2,0,,,,,,2,1,1,1,1,2,2,,,,,,,,4,5,2,1,4,4,2,1,5,4,3,2,4,5,3,2,4,4,3,5,8,1,3,4
160.0,25,0,6,1,1,2,1,1,0,,,,,,2,0,1,2,1,4,3,,,,,,,,4,4,3,2,5,3,2,1,5,3,2,1,5,4,3,2,4,3,1,1,4,3,5,4
162.0,21,1,4,2,2,2,1,1,0,,,,,,3,0,0,2,1,3,3,,,,,,,,5,3,2,3,5,4,3,3,4,3,2,2,5,4,3,2,4,3,2,2,5,3,4,4
163.0,24,1,5,1,1,2,3,1,0,,,,,,3,0,1,1,1,2,3,,,,,,,,5,3,3,2,5,3,1,1,4,3,3,3,4,3,2,2,5,3,2,2,5,4,3,4
164.0,23,1,5,1,2,3,4,1,0,,,,,,3,0,0,2,1,1,3,,,,,,,,4,3,2,2,5,3,2,2,5,2,3,2,5,3,2,2,4,3,2,2,4,3,5,4
165.0,25,0,6,1,1,3,4,1,0,,,,,,3,0,0,2,3,1,3,,,,,,,,5,4,2,2,4,3,3,3,5,3,3,3,5,4,3,3,5,2,2,2,3,4,5,4
166.0,24,0,5,1,2,2,3,1,0,,,,,,3,0,1,1,3,4,3,,,,,,,,5,4,3,3,5,3,2,3,5,3,2,2,5,3,2,2,3,3,2,2,4,4,4,4
167.0,21,1,3,1,1,2,3,2,0,,,,,,3,0,0,2,1,1,3,,,,,,,,5,4,3,3,5,3,2,2,5,3,2,2,5,3,3,2,5,3,2,2,4,4,4,4
168.0,24,1,5,1,1,1,4,1,0,,,,,,3,0,0,2,1,2,3,,,,,,,,5,3,3,3,5,3,3,3,4,3,2,4,5,3,3,2,5,3,2,2,4,4,4,4
169.0,25,0,6,1,1,2,4,1,0,,,,,,3,0,0,2,1,2,3,,,,,,,,5,4,2,2,4,3,2,2,5,4,3,3,5,4,3,3,5,3,3,3,4,4,4,4
170.0,23,1,4,1,2,2,3,1,0,,,,,,3,0,0,1,1,2,3,,,,,,,,5,4,2,2,4,3,2,3,5,3,3,3,5,3,3,2,5,4,2,2,4,5,3,4
171.0,21,1,1,1,2,3,3,1,0,,,,,,3,0,1,2,1,2,3,,,,,,,,4,3,2,2,5,4,2,3,4,3,2,2,5,3,3,2,5,2,2,4,4,3,5,4
172.0,24,0,6,1,1,3,2,1,0,,,,,,2,0,0,1,1,4,2,,,,,,,,5,4,3,3,5,2,3,3,5,3,4,3,5,3,3,3,5,3,3,3,4,4,4,4
173.0,24,0,6,1,0,0,2,3,0,,,,,,2,0,0,1,2,2,3,,,,,,,,5,3,3,2,5,4,3,2,5,3,2,2,4,3,2,2,5,3,2,3,3,5,4,4
174.0,24,1,5,1,1,1,1,1,0,,,,,,3,0,1,1,1,1,3,,,,,,,,4,3,3,3,5,3,3,2,5,3,3,3,4,3,3,3,5,3,2,2,3,5,4,4
175.0,25,1,5,1,2,2,3,1,0,,,,,,3,0,0,1,1,2,3,,,,,,,,4,2,3,3,5,2,3,3,5,3,3,3,3,4,3,3,5,3,2,2,4,3,4,5
176.0,25,1,6,2,2,3,2,1,0,,,,,,3,0,0,1,1,2,3,,,,,,,,5,1,3,3,4,2,3,3,5,4,1,2,5,3,3,3,5,3,2,2,4,3,5,4
177.0,22,1,3,1,2,2,3,2,0,,,,,,3,0,0,2,1,1,3,,,,,,,,5,3,2,3,3,5,3,2,4,2,2,3,5,3,3,3,5,2,2,2,4,4,4,4
178.0,23,1,4,1,2,2,2,1,0,,,,,,3,0,0,2,3,2,3,,,,,,,,4,4,3,3,5,2,2,3,5,2,3,3,5,2,2,3,4,3,2,2,4,4,3,5
179.0,21,1,1,1,2,2,3,3,0,,,,,,3,0,0,2,1,5,3,,,,,,,,5,4,3,2,5,3,2,2,5,3,2,1,4,3,3,4,4,3,2,3,3,6,4,3
180.0,25,1,5,2,2,2,4,1,0,,,,,,3,0,1,2,1,3,3,,,,,,,,5,2,3,5,3,3,4,3,4,2,3,3,4,3,3,2,5,4,1,2,4,4,3,5
181.0,22,0,3,2,2,2,4,3,0,,,,,,3,0,0,1,1,4,3,,,,,,,,5,4,3,2,5,3,2,1,5,2,3,3,5,3,2,2,5,3,3,3,4,4,4,4
182.0,23,0,4,2,3,3,3,1,0,,,,,,3,0,0,2,1,1,3,,,,,,,,5,3,2,2,4,4,3,2,5,5,3,3,5,5,3,2,4,4,2,3,3,4,4,5
183.0,25,0,6,1,3,3,2,1,0,,,,,,3,0,1,1,1,1,3,,,,,,,,4,4,2,1,3,4,3,3,5,4,2,3,5,4,3,2,5,4,3,2,4,2,5,5
184.0,23,0,4,1,2,2,2,1,0,,,,,,3,0,0,2,1,1,3,,,,,,,,5,4,1,1,5,4,1,1,5,4,1,2,5,4,2,2,5,4,2,2,4,4,4,4
185.0,21,1,2,1,1,2,3,1,0,,,,,,3,0,0,1,1,2,3,,,,,,,,5,4,2,1,5,4,2,2,5,4,1,2,5,4,2,2,5,4,2,1,4,5,3,4
186.0,24,1,5,1,1,2,3,1,0,,,,,,3,0,1,1,1,2,3,,,,,,,,5,4,2,1,5,3,2,1,5,3,1,2,5,4,2,2,5,4,2,1,4,5,3,4
187.0,20,0,2,1,1,2,3,1,0,,,,,,3,0,0,1,1,2,3,,,,,,,,5,3,1,1,5,4,2,1,5,3,2,1,5,4,2,2,5,4,2,2,4,5,3,4
188.0,19,0,1,2,2,2,3,1,0,,,,,,3,0,0,1,1,2,3,,,,,,,,5,4,2,2,5,4,2,1,5,3,1,2,5,4,3,3,5,4,2,2,5,3,3,5
189.0,19,1,1,2,1,1,3,1,0,,,,,,3,0,0,1,1,3,3,,,,,,,,5,3,2,1,5,4,3,3,5,3,2,3,5,4,3,2,5,4,2,1,5,3,3,5
190.0,18,0,1,1,3,3,3,1,0,,,,,,3,0,1,1,3,4,3,,,,,,,,5,3,2,3,5,4,3,3,5,4,3,3,5,3,3,3,5,3,2,1,4,4,3,5
191.0,19,1,1,1,3,3,2,1,0,,,,,,3,0,0,1,3,4,3,,,,,,,,5,3,3,3,5,3,3,3,5,3,2,3,5,3,3,3,5,3,2,1,4,4,3,5
192.0,18,1,1,1,2,2,2,1,0,,,,,,3,0,0,1,3,4,3,,,,,,,,5,4,2,2,5,3,3,3,5,3,3,3,4,3,3,2,4,3,2,1,4,4,3,5
193.0,19,0,2,1,2,2,2,1,0,,,,,,3,0,1,1,3,4,3,,,,,,,,5,3,2,3,4,3,2,2,4,3,3,3,3,2,2,2,4,3,2,2,6,5,2,3
194.0,21,1,4,2,3,2,2,1,0,,,,,,3,0,0,1,1,3,3,,,,,,,,5,3,2,3,5,3,2,3,5,4,3,3,5,3,2,1,4,2,1,2,6,5,2,3
195.0,22,0,5,1,2,1,2,2,0,,,,,,3,0,0,1,3,4,3,,,,,,,,5,3,2,2,5,4,3,2,5,3,2,2,5,3,2,1,5,5,2,2,5,5,3,3
196.0,23,0,5,1,2,2,3,2,0,,,,,,3,0,1,1,1,1,3,,,,,,,,4,3,2,2,5,3,2,3,5,4,3,2,5,3,2,2,5,4,3,3,5,5,3,3
197.0,24,0,5,1,2,2,2,2,0,,,,,,3,0,0,1,1,1,3,,,,,,,,5,3,2,2,5,4,3,2,5,4,3,2,5,3,2,2,5,3,2,2,4,4,4,4
198.0,24,1,5,1,1,2,2,3,0,,,,,,3,0,0,1,2,3,3,,,,,,,,5,4,3,2,5,3,2,2,4,3,2,1,5,4,3,2,5,3,3,2,6,3,4,3
199.0,25,0,6,1,2,2,2,1,0,,,,,,3,0,0,1,1,1,3,,,,,,,,4,3,2,2,4,3,2,2,5,4,2,2,5,3,2,2,4,3,2,2,5,5,3,3
200.0,24,0,5,1,1,1,1,1,0,,,,,,3,0,0,1,2,3,3,,,,,,,,5,3,2,2,5,4,3,3,5,3,2,1,5,3,3,2,2,3,3,2,5,3,3,5
201.0,22,0,3,1,2,1,1,2,0,,,,,,3,0,0,1,2,1,3,,,,,,,,5,4,3,2,4,3,3,3,5,3,2,2,5,4,3,2,4,3,1,2,5,5,3,3
202.0,24,0,5,1,1,2,2,2,0,,,,,,2,0,0,2,5,5,2,,,,,,,,5,4,1,2,3,4,2,2,4,5,3,2,5,4,3,2,4,4,2,2,2,2,6,6
203.0,24,0,6,1,2,2,1,1,0,,,,,,2,0,1,2,5,5,2,,,,,,,,4,4,2,1,3,3,2,3,5,4,3,2,4,4,2,1,3,3,4,4,1,2,7,6
204.0,24,1,5,1,2,2,1,1,0,,,,,,3,0,0,1,1,2,3,,,,,,,,5,3,2,2,4,3,2,2,5,4,2,3,5,3,1,2,5,4,2,2,4,4,3,5
205.0,22,0,3,1,2,1,2,2,0,,,,,,3,0,0,1,1,1,3,,,,,,,,4,3,2,2,5,3,2,2,5,4,3,2,5,4,3,2,4,4,1,2,3,3,5,3
206.0,23,0,4,1,1,2,3,2,0,,,,,,3,0,0,2,3,1,3,,,,,,,,5,4,2,2,4,3,2,2,5,3,2,2,4,3,2,5,4,3,3,4,5,3,4,4
207.0,24,0,5,1,2,1,2,2,0,,,,,,3,0,1,2,1,1,3,,,,,,,,5,4,2,3,4,3,2,2,5,3,2,2,4,3,2,2,5,3,2,2,5,3,4,4
208.0,22,0,4,1,1,1,2,2,0,,,,,,3,0,0,1,1,1,3,,,,,,,,5,3,2,3,4,3,2,2,5,3,2,2,3,3,2,5,4,3,2,4,4,4,4,4
209.0,21,0,3,1,2,1,1,1,0,,,,,,3,0,0,1,2,2,3,,,,,,,,4,4,3,3,4,4,3,3,4,3,2,2,5,3,2,3,4,4,2,2,3,4,7,2
210.0,18,0,1,1,1,1,1,1,0,,,,,,3,0,1,2,1,1,3,,,,,,,,5,4,3,3,3,3,3,3,3,4,1,1,4,4,2,3,3,3,3,3,4,4,4,4
211.0,24,0,5,1,2,2,1,1,0,,,,,,2,0,1,2,3,5,2,,,,,,,,4,4,3,3,4,3,2,3,3,3,3,3,4,5,3,2,4,4,3,3,2,2,6,6
212.0,25,0,6,1,2,2,1,1,0,,,,,,2,0,0,2,3,5,2,,,,,,,,4,4,2,2,4,3,2,1,4,5,3,3,4,2,2,5,3,2,3,5,4,0,6,6
213.0,21,1,1,1,3,2,2,2,0,,,,,,1,0,0,2,3,6,1,,,,,,,,2,3,4,5,4,3,4,3,3,4,2,3,3,3,4,4,3,3,2,3,4,5,4,3
214.0,25,0,6,1,3,2,1,2,0,,,,,,2,0,0,2,3,6,2,,,,,,,,3,3,3,4,3,2,4,4,2,2,4,4,1,2,4,5,2,2,3,2,6,6,2,2
215.0,25,0,6,1,1,2,2,3,0,,,,,,2,0,0,2,3,6,2,,,,,,,,4,5,2,3,4,4,2,1,4,3,2,3,4,3,2,3,4,3,3,3,6,5,3,2
216.0,19,1,1,2,2,3,1,1,0,,,,,,1,0,0,2,3,6,1,,,,,,,,2,2,4,5,2,1,3,4,2,2,4,3,1,2,4,5,3,2,4,3,7,6,1,2
217.0,24,1,5,1,3,3,1,1,0,,,,,,2,0,0,2,3,6,2,,,,,,,,4,5,3,2,4,3,2,3,4,3,2,3,4,3,4,3,2,2,4,5,6,7,1,2
218.0,21,0,3,2,2,3,1,1,0,,,,,,1,0,0,2,3,5,1,,,,,,,,2,3,4,3,3,3,4,4,3,2,3,4,3,2,3,4,3,3,3,3,5,4,3,4
219.0,22,1,4,1,2,2,1,1,0,,,,,,2,0,1,2,3,4,2,,,,,,,,3,3,4,2,2,3,3,3,4,2,3,4,5,3,2,2,3,3,4,3,4,4,3,5
220.0,24,0,6,1,3,2,2,2,0,,,,,,1,0,0,1,1,4,1,,,,,,,,2,3,3,4,3,3,2,3,4,3,2,2,1,2,2,3,3,3,3,3,2,4,8,2
221.0,24,1,4,2,2,3,3,1,0,,,,,,1,0,0,1,2,3,1,,,,,,,,2,2,4,3,2,1,3,4,2,2,5,5,2,3,4,3,2,3,4,3,6,7,1,2
222.0,25,0,6,2,1,1,1,2,0,,,,,,2,0,0,2,2,3,2,,,,,,,,2,1,3,4,3,3,3,3,3,2,2,2,3,4,4,4,2,1,4,4,6,6,2,2
223.0,24,1,4,1,1,1,1,1,0,,,,,,2,0,0,1,1,1,2,,,,,,,,1,2,3,4,3,3,2,2,3,3,2,2,3,3,2,2,4,3,2,2,5,5,3,3
224.0,22,0,4,2,2,1,1,1,0,,,,,,2,0,0,1,2,2,1,,,,,,,,1,2,3,3,4,2,2,3,3,4,3,3,2,3,3,3,4,3,2,3,4,5,3,4
225.0,23,1,5,1,1,1,2,2,0,,,,,,1,0,0,1,2,2,3,,,,,,,,3,4,2,2,3,4,3,2,3,4,3,3,2,2,3,3,4,3,2,3,4,4,5,3
226.0,24,1,5,1,2,2,1,1,0,,,,,,2,0,0,1,2,3,2,,,,,,,,2,3,2,2,3,3,2,2,2,3,3,2,2,3,4,3,3,2,3,4,3,5,4,4
227.0,23,1,6,2,2,3,2,2,1,aritmi,,,,,2,1,1,2,3,1,2,,,,,,,,5,4,1,2,3,4,1,1,4,5,2,1,3,4,3,2,3,2,3,3,7,5,2,2
228.0,22,0,4,1,1,2,2,3,0,,,,,,2,1,1,1,1,1,2,,,,,,,,2,3,3,4,3,2,3,4,3,2,3,3,4,3,3,2,3,2,3,4,4,5,3,4
229.0,24,0,6,1,2,1,1,1,0,,,,,,2,1,0,1,3,1,3,,,,,,,,3,2,2,3,4,3,2,2,3,4,3,2,3,4,3,2,3,4,3,4,4,6,3,3
230.0,23,1,4,2,1,2,2,3,0,,,,,,2,1,0,0,2,2,3,,,,,,,,4,3,2,3,3,2,2,3,2,3,4,3,2,3,3,3,2,3,3,3,6,4,3,3
231.0,22,0,3,2,1,1,3,3,0,,,,,,1,1,0,0,3,2,2,,,,,,,,3,4,2,2,3,3,4,3,2,3,4,3,2,3,4,3,4,3,3,2,5,3,4,4
232.0,23,1,4,2,1,1,2,2,0,,,,,,1,0,0,0,4,5,1,,,,,,,,2,2,3,4,2,3,4,5,2,2,3,3,2,1,4,5,3,4,3,2,7,6,2,1
233.0,24,0,6,1,2,3,2,2,0,,,,,,2,0,0,1,1,5,2,,,,,,,,4,5,3,3,4,3,2,3,3,4,5,4,3,3,3,3,3,3,3,3,4,5,3,4
234.0,23,0,4,1,2,2,3,2,0,,,,,,1,0,0,1,3,4,3,,,,,,,,2,3,3,2,2,3,4,5,4,3,3,4,3,3,3,3,3,3,3,3,4,4,4,4
235.0,22,1,3,2,1,1,1,1,0,,,,,,2,0,0,0,5,3,3,,,,,,,,2,3,3,4,3,3,3,3,3,3,3,3,2,3,3,3,3,4,3,3,4,4,4,4
236.0,23,0,4,2,1,1,1,1,0,,,,,,2,0,0,0,3,2,1,,,,,,,,2,3,2,2,3,3,4,3,3,2,2,2,3,3,3,2,2,3,3,3,5,3,5,3
237.0,21,1,3,2,2,3,2,2,0,,,,,,1,0,0,0,4,3,2,,,,,,,,3,3,4,2,3,4,3,2,3,3,3,3,2,3,3,3,3,3,3,3,4,5,6,1
238.0,24,0,6,2,3,2,2,3,0,,,,,,2,0,0,0,1,2,2,,,,,,,,3,3,3,3,3,4,3,3,2,3,3,3,2,3,3,4,3,3,3,4,4,4,4,4
239.0,24,0,6,1,1,1,1,1,0,,,,,,2,1,1,0,3,2,2,,,,,,,,2,3,2,2,2,3,3,4,4,3,3,3,3,3,4,2,3,3,3,3,4,5,6,1